Target
Histamine H3 receptor
Ligand
BDBM50193199
Substrate
Meas. Tech.
ChEMBL_523447 (CHEMBL1008299)
Ki
7±n/a nM
Citation
 Pierson, PDFettes, AFreichel, CGatti-McArthur, SHertel, CHuwyler, JMohr, PNakagawa, TNettekoven, MPlancher, JMRaab, SRichter, HRoche, ORodríguez Sarmiento, RMSchmitt, MSchuler, FTakahashi, TTaylor, SUllmer, CWiegand, R 5-hydroxyindole-2-carboxylic acid amides: novel histamine-3 receptor inverse agonists for the treatment of obesity. J Med Chem 52:3855-68 (2009)  
Target
Name:
Histamine H3 receptor
Synonyms:
G-protein coupled receptor 97 HH3R HRH3 Histamine H3 receptor (H3) Histamine receptor (H3 and H4)
Type:
G Protein-Coupled Receptor (GPCR)
Mol. Mass.:
48691.47
Organism:
Homo sapiens (Human)
Description:
Binding assays were using CHO cells stably expressing hH3R receptors.
Residue:
445
  
Inhibitor
Name:
BDBM50193199
Synonyms:
(S)-1-(2-(pyrrolidin-1-ylmethyl)pyrrolidin-1-yl)-3-(4-(trifluoromethyl)phenyl)prop-2-en-1-one CHEMBL218790
Type:
Small organic molecule
Emp. Form.:
C19H23F3N2O
Mol. Mass.:
352.3939
SMILES:
FC(F)(F)c1ccc(\C=C\C(=O)N2CCC[C@H]2CN2CCCC2)cc1
: