Target
Histamine H3 receptor
Ligand
BDBM50269052
Substrate
Meas. Tech.
ChEMBL_523445 (CHEMBL1008297)
Ki
95±n/a nM
Citation
 Pierson, PDFettes, AFreichel, CGatti-McArthur, SHertel, CHuwyler, JMohr, PNakagawa, TNettekoven, MPlancher, JMRaab, SRichter, HRoche, ORodríguez Sarmiento, RMSchmitt, MSchuler, FTakahashi, TTaylor, SUllmer, CWiegand, R 5-hydroxyindole-2-carboxylic acid amides: novel histamine-3 receptor inverse agonists for the treatment of obesity. J Med Chem 52:3855-68 (2009)  
Target
Name:
Histamine H3 receptor
Synonyms:
HH3R Hrh3
Type:
G Protein-Coupled Receptor (GPCR)
Mol. Mass.:
48607.98
Organism:
Rattus norvegicus (rat)
Description:
Residue:
445
  
Inhibitor
Name:
BDBM50269052
Synonyms:
(6-(1-isopropylpiperidin-4-yloxy)-1H-indol-2-yl)(morpholino)methanone | CHEMBL522243
Type:
Small organic molecule
Emp. Form.:
C21H29N3O3
Mol. Mass.:
371.4733
SMILES:
CC(C)N1CCC(CC1)Oc1ccc2cc([nH]c2c1)C(=O)N1CCOCC1
: