Target
Kappa-type opioid receptor
Ligand
BDBM50268466
Substrate
Meas. Tech.
ChEMBL_523522 (CHEMBL1000644)
Ki
78±n/a nM
Citation
 Dolle, REMichaut, MMartinez-Teipel, BSeida, PRAjello, CWMuller, ALDeHaven, RNCarroll, PJ Nascent structure-activity relationship study of a diastereomeric series of kappa opioid receptor antagonists derived from CJ-15,208. Bioorg Med Chem Lett 19:3647-50 (2009)  
Target
Name:
Kappa-type opioid receptor
Synonyms:
K-OR-1 Kappa-opioid receptor (KOR) Kappa-type opioid receptor (KOR) OPIATE Kappa OPRK1 kappa opioid receptor (KOR)
Type:
G Protein-Coupled Receptor (GPCR)
Mol. Mass.:
42648.76
Organism:
Homo sapiens (Human)
Description:
P41145
Residue:
380
  
Inhibitor
Name:
BDBM50268466
Synonyms:
CHEMBL510506 | c[L-mTyr-D-pro-L-Phe-D-trp]
Type:
Small organic molecule
Emp. Form.:
C34H35N5O5
Mol. Mass.:
593.6722
SMILES:
Oc1cccc(C[C@@H]2NC(=O)[C@@H](Cc3c[nH]c4ccccc34)NC(=O)[C@H](Cc3ccccc3)NC(=O)[C@H]3CCCN3C2=O)c1
: