Target
Kappa-type opioid receptor
Ligand
BDBM50268588
Substrate
Meas. Tech.
ChEMBL_523522 (CHEMBL1000644)
Ki
>1000±n/a nM
Citation
 Dolle, REMichaut, MMartinez-Teipel, BSeida, PRAjello, CWMuller, ALDeHaven, RNCarroll, PJ Nascent structure-activity relationship study of a diastereomeric series of kappa opioid receptor antagonists derived from CJ-15,208. Bioorg Med Chem Lett 19:3647-50 (2009)  
Target
Name:
Kappa-type opioid receptor
Synonyms:
K-OR-1 Kappa-opioid receptor (KOR) Kappa-type opioid receptor (KOR) OPIATE Kappa OPRK1 kappa opioid receptor (KOR)
Type:
G Protein-Coupled Receptor (GPCR)
Mol. Mass.:
42648.76
Organism:
Homo sapiens (Human)
Description:
P41145
Residue:
380
  
Inhibitor
Name:
BDBM50268588
Synonyms:
Ac-D-pro-L-Phe-L-Trp-L-Phe-NH2 | CHEMBL506595
Type:
Small organic molecule
Emp. Form.:
C36H40N6O5
Mol. Mass.:
636.74
SMILES:
CC(=O)N1CCC[C@@H]1C(=O)N[C@@H](Cc1ccccc1)C(=O)N[C@@H](Cc1c[nH]c2ccccc12)C(=O)N[C@@H](Cc1ccccc1)C(N)=O
: