Target
Mu-type opioid receptor
Ligand
BDBM50268526
Substrate
Meas. Tech.
ChEMBL_523523 (CHEMBL1000645)
Ki
43±n/a nM
Citation
 Dolle, REMichaut, MMartinez-Teipel, BSeida, PRAjello, CWMuller, ALDeHaven, RNCarroll, PJ Nascent structure-activity relationship study of a diastereomeric series of kappa opioid receptor antagonists derived from CJ-15,208. Bioorg Med Chem Lett 19:3647-50 (2009)  
Target
Name:
Mu-type opioid receptor
Synonyms:
M-OR-1 MOR-1 MUOR1 Mu opiate receptor OPRM1 hMOP | mu-type opioid receptor isoform MOR-1
Type:
G Protein-Coupled Receptor (GPCR)
Mol. Mass.:
44789.51
Organism:
Homo sapiens (Human)
Description:
P35372
Residue:
400
  
Inhibitor
Name:
BDBM50268526
Synonyms:
CHEMBL506211 | c[L-Phe-D-pro-L-Tyr(OMe)-D-trp]
Type:
Small organic molecule
Emp. Form.:
C35H37N5O5
Mol. Mass.:
607.6988
SMILES:
COc1ccc(C[C@@H]2NC(=O)[C@H]3CCCN3C(=O)[C@H](Cc3ccccc3)NC(=O)[C@@H](Cc3c[nH]c4ccccc34)NC2=O)cc1
: