Target
Mu-type opioid receptor
Ligand
BDBM50268585
Substrate
Meas. Tech.
ChEMBL_523523 (CHEMBL1000645)
Ki
360±n/a nM
Citation
 Dolle, REMichaut, MMartinez-Teipel, BSeida, PRAjello, CWMuller, ALDeHaven, RNCarroll, PJ Nascent structure-activity relationship study of a diastereomeric series of kappa opioid receptor antagonists derived from CJ-15,208. Bioorg Med Chem Lett 19:3647-50 (2009)  
Target
Name:
Mu-type opioid receptor
Synonyms:
M-OR-1 MOR-1 MUOR1 Mu opiate receptor OPRM1 hMOP | mu-type opioid receptor isoform MOR-1
Type:
G Protein-Coupled Receptor (GPCR)
Mol. Mass.:
44789.51
Organism:
Homo sapiens (Human)
Description:
P35372
Residue:
400
  
Inhibitor
Name:
BDBM50268585
Synonyms:
Ac-L-Phe-D-trp-L-Phe-D-pro-NH2 | CHEMBL442612
Type:
Small organic molecule
Emp. Form.:
C36H40N6O5
Mol. Mass.:
636.74
SMILES:
CC(=O)N[C@@H](Cc1ccccc1)C(=O)N[C@H](Cc1c[nH]c2ccccc12)C(=O)N[C@@H](Cc1ccccc1)C(=O)N1CCC[C@@H]1C(N)=O
: