Target
Melanocortin receptor 5
Ligand
BDBM50268795
Substrate
Meas. Tech.
ChEMBL_523575 (CHEMBL997225)
IC50
2.5±n/a nM
Citation
 Qu, HCai, MMayorov, AVGrieco, PZingsheim, MTrivedi, DHruby, VJ Substitution of arginine with proline and proline derivatives in melanocyte-stimulating hormones leads to selectivity for human melanocortin 4 receptor. J Med Chem 52:3627-35 (2009)  
Target
Name:
Melanocortin receptor 5
Synonyms:
MC-2 MC5R Melanocortin MC5 Melanocortin receptor 5 | Melanocortin receptor 5 (MC5R)
Type:
Enzyme
Mol. Mass.:
36612.92
Organism:
Homo sapiens (Human)
Description:
P33032
Residue:
325
  
Inhibitor
Name:
BDBM50268795
Synonyms:
Ac-Nle-c[Asp-trans-4-guanidinyl-Pro-DPhe-Arg-Trp-Lys]-NH2 | CHEMBL500743
Type:
Small organic molecule
Emp. Form.:
C50H72N16O9
Mol. Mass.:
1041.2085
SMILES:
CCCC[C@H](NC(C)=O)C(=O)N[C@H]1CC(=O)NCCCC[C@H](NC(=O)[C@H](Cc2c[nH]c3ccccc23)NC(=O)[C@H](CCCN=C(N)N)NC(=O)[C@@H](Cc2ccccc2)NC(=O)[C@@H]2C[C@H](CN2C1=O)N=C(N)N)C(N)=O
: