Target
Adenosine receptor A2a
Ligand
BDBM50110981
Substrate
Meas. Tech.
ChEMBL_520171 (CHEMBL947859)
Ki
24000±n/a nM
Citation
 Borrmann, THinz, SBertarelli, DCLi, WFlorin, NCScheiff, ABMüller, CE 1-alkyl-8-(piperazine-1-sulfonyl)phenylxanthines: development and characterization of adenosine A2B receptor antagonists and a new radioligand with subnanomolar affinity and subtype specificity. J Med Chem 52:3994-4006 (2009)  
Target
Name:
Adenosine receptor A2a
Synonyms:
AA2AR_RAT Adenosine A2 receptor Adenosine Receptors A2a (A2a) Adenosine receptors A2a Rat striatal adenosine A2a receptor
Type:
G Protein-Coupled Receptor (GPCR)
Mol. Mass.:
45015.65
Organism:
Rattus norvegicus (rat)
Description:
Rat A2A receptors expressed in CHO cells.
Residue:
410
  
Inhibitor
Name:
BDBM50110981
Synonyms:
CHEMBL34862 Potassium; 4-(2,6-dioxo-1-propyl-2,3,6,7-tetrahydro-1H-purin-8-yl)-benzenesulfonate(PSB-1115)
Type:
Small organic molecule
Emp. Form.:
C14H13N4O5S
Mol. Mass.:
349.342
SMILES:
CCCn1c(=O)[nH]c2nc([nH]c2c1=O)-c1ccc(cc1)S([O-])(=O)=O
: