Target
Adenosine receptor A2b
Ligand
BDBM50268211
Substrate
Meas. Tech.
ChEMBL_520180 (CHEMBL948832)
Ki
1.06±n/a nM
Citation
 Borrmann, THinz, SBertarelli, DCLi, WFlorin, NCScheiff, ABMüller, CE 1-alkyl-8-(piperazine-1-sulfonyl)phenylxanthines: development and characterization of adenosine A2B receptor antagonists and a new radioligand with subnanomolar affinity and subtype specificity. J Med Chem 52:3994-4006 (2009)  
Target
Name:
Adenosine receptor A2b
Synonyms:
AA2BR_HUMAN ADORA2B Adenosine receptors A2b | Adenosine receptors; A2a & A2b
Type:
G Protein-Coupled Receptor (GPCR)
Mol. Mass.:
36341.22
Organism:
Homo sapiens (Human)
Description:
Residue:
332
  
Inhibitor
Name:
BDBM50268211
Synonyms:
8-(4-(4-Benzo[1,3]dioxol-5-ylmethylpiperazine-1-sulfonyl)phenyl)-1-propyl-3,7-dihydropurine-2,6-dione | CHEMBL486893
Type:
Small organic molecule
Emp. Form.:
C26H28N6O6S
Mol. Mass.:
552.602
SMILES:
CCCn1c(=O)[nH]c2nc([nH]c2c1=O)-c1ccc(cc1)S(=O)(=O)N1CCN(Cc2ccc3OCOc3c2)CC1
: