Target
Vascular endothelial growth factor receptor 3
Ligand
BDBM50279238
Substrate
Meas. Tech.
ChEMBL_545079 (CHEMBL1017195)
IC50
3±n/a nM
Citation
 Roth, GJHeckel, AColbatzky, FHandschuh, SKley, JLehmann-Lintz, TLotz, RTontsch-Grunt, UWalter, RHilberg, F Design, synthesis, and evaluation of indolinones as triple angiokinase inhibitors and the discovery of a highly specific 6-methoxycarbonyl-substituted indolinone (BIBF 1120). J Med Chem 52:4466-80 (2009)  
Target
Name:
Vascular endothelial growth factor receptor 3
Synonyms:
FLT-4 Fms-like tyrosine kinase 4 VEGFR-3 VGFR3_HUMAN Vascular endothelial growth factor receptor 3 (VEGFR-3) | Vascular endothelial growth factor receptor 3 (VEGFR3)
Type:
Protein
Mol. Mass.:
152749.58
Organism:
Homo sapiens (Human)
Description:
P35916-2
Residue:
1363
  
Inhibitor
Name:
BDBM50279238
Synonyms:
(Z)-3-({4-[N-Acetyl-(3-dimethylaminopropyl)-amino]-phenylamino}-phenyl-methylene)-2-oxo-2,3-dihydro-1H-indole-6-carboxylicAcid Methyl Ester | CHEMBL525909
Type:
Small organic molecule
Emp. Form.:
C30H32N4O4
Mol. Mass.:
512.5995
SMILES:
COC(=O)c1ccc2C(C(=Nc3ccc(cc3)N(CCCN(C)C)C(C)=O)c3ccccc3)C(=O)Nc2c1
: