Target
Neuronal acetylcholine receptor subunit alpha-4
Ligand
BDBM82070
Substrate
Meas. Tech.
ChEMBL_546018 (CHEMBL1028496)
Ki
0.94±n/a nM
Citation
 Bunnelle, WHTietje, KRFrost, JMPeters, DJi, JLi, TScanio, MJShi, LAnderson, DJDyhring, TGrønlien, JHWeen, HThorin-Hagene, KMeyer, MD Octahydropyrrolo[3,4-c]pyrrole: a diamine scaffold for construction of either alpha4beta2 or alpha7-selective nicotinic acetylcholine receptor (nAChR) ligands. Substitutions that switch subtype selectivity. J Med Chem 52:4126-41 (2009)  
Target
Name:
Neuronal acetylcholine receptor subunit alpha-4
Synonyms:
ACHA4_RAT Cholinergic, Nicotinic Alpha4Beta2 Chrna4 Neuronal acetylcholine receptor (alpha4beta2 nAChR) Neuronal acetylcholine receptor subunit alpha 4 beta 2 | Neuronal acetylcholine receptor subunit alpha-4
Type:
Enzyme
Mol. Mass.:
70196.44
Organism:
Rattus norvegicus (Rat)
Description:
P09483
Residue:
630
  
Inhibitor
Name:
BDBM82070
Synonyms:
CAS_29790-52-1 Nicotine-D salicylate US9303017, Nicotine
Type:
Emp. Form.:
C10H14N2
Mol. Mass.:
162.2316
SMILES:
CN1CCC[C@H]1c1cccnc1
: