Target
Pro-cathepsin H
Ligand
BDBM16509
Substrate
Meas. Tech.
ChEMBL_498768 (CHEMBL1021960)
IC50
>100000±n/a nM
Citation
 Kang, DHJun, KYLee, JPPak, CSNa, YKwon, Y Identification of 3-acetyl-2-aminoquinolin-4-one as a novel, nonpeptidic scaffold for specific calpain inhibitory activity. J Med Chem 52:3093-7 (2009)  
Target
Name:
Pro-cathepsin H
Synonyms:
CATH_HUMAN CPSB Cathepsin H Cathepsin H light chain | Cathepsin H mini chain
Type:
PROTEIN
Mol. Mass.:
37402.31
Organism:
Homo sapiens (Human)
Description:
ChEMBL_1459870
Residue:
335
  
Inhibitor
Name:
BDBM16509
Synonyms:
(2S)-1-[(2S,3S)-3-methyl-2-{[(2S,3S)-3-(propylcarbamoyl)oxiran-2-yl]formamido}pentanoyl]pyrrolidine-2-carboxylic acid CHEMBL490920 PrNH-tES-Ile-Pro-OH | epoxysuccinyl derivative CA074
Type:
Small organic molecule
Emp. Form.:
C18H29N3O6
Mol. Mass.:
383.4394
SMILES:
[H][C@@]1(O[C@]1([H])C(=O)N[C@@H]([C@@H](C)CC)C(=O)N1CCC[C@H]1C(O)=O)C(=O)NCCC
: