Target
Sonic hedgehog protein
Ligand
BDBM50249182
Substrate
Meas. Tech.
ChEMBL_499790 (CHEMBL969584)
EC50
200±n/a nM
Citation
 Mahindroo, NPunchihewa, CFujii, N Hedgehog-Gli signaling pathway inhibitors as anticancer agents. J Med Chem 52:3829-45 (2009)  
Target
Name:
Sonic hedgehog protein
Synonyms:
Hhg1 Shh
Type:
Protein
Mol. Mass.:
47784.50
Organism:
Mus musculus (Mouse)
Description:
Q62226
Residue:
437
  
Inhibitor
Name:
BDBM50249182
Synonyms:
(1'S,2S,2'R,3R,3aS,6S,7aR,10'S,11'S)-2',3,6,16'-tetramethyl-3a,4,5,6,7,7a-hexahydro-3H-spiro[furo[3,2-b]pyridine-2,14'-tetracyclo[8.8.0.0^{2,7}.0^{11,17}]octadecane]-6',16'-dien-5'-one (2S,3R,3aS,6S,6a'S,6b'S,7aR,12a'S,12b'R,Z)-3,6,11',12b'-tetramethyl-3a,4,5,5',6,6',6a',6b',7,7a,7',8',10',12',12a',12b'-hexadecahydro-1'H,3H-spiro[furo[3,2-b]pyridine-2,9'-naphtho[2,1-a]azulen]-3'(2'H)-one | CHEMBL473393
Type:
Small organic molecule
Emp. Form.:
C28H41NO2
Mol. Mass.:
423.6306
SMILES:
C[C@@H]1[C@@H]2NC[C@@H](C)C[C@H]2O[C@]11CC[C@H]2[C@@H]3CCC4=CC(=O)CC[C@]4(C)[C@H]3CC2=C(C)C1
: