Target
Sonic hedgehog protein
Ligand
BDBM50249488
Substrate
Meas. Tech.
ChEMBL_499790 (CHEMBL969584)
IC50
20±n/a nM
Citation
 Mahindroo, NPunchihewa, CFujii, N Hedgehog-Gli signaling pathway inhibitors as anticancer agents. J Med Chem 52:3829-45 (2009)  
Target
Name:
Sonic hedgehog protein
Synonyms:
Hhg1 Shh
Type:
Protein
Mol. Mass.:
47784.50
Organism:
Mus musculus (Mouse)
Description:
Q62226
Residue:
437
  
Inhibitor
Name:
BDBM50249488
Synonyms:
4-benzyl-N-((3,5-dimethyl-1-phenyl-1H-pyrazol-4-yl)methylene)piperazin-1-amine | CHEMBL515916
Type:
Small organic molecule
Emp. Form.:
C23H27N5
Mol. Mass.:
373.494
SMILES:
Cc1nn(c(C)c1C=NN1CCN(Cc2ccccc2)CC1)-c1ccccc1
: