Target
Renin
Ligand
BDBM50259461
Substrate
Meas. Tech.
ChEMBL_501175 (CHEMBL975288)
IC50
0.67±n/a nM
Citation
 Bezençon, OBur, DWeller, TRichard-Bildstein, SRemen, LSifferlen, TCorminboeuf, OGrisostomi, CBoss, CPrade, LDelahaye, STreiber, AStrickner, PBinkert, CHess, PSteiner, BFischli, W Design and preparation of potent, nonpeptidic, bioavailable renin inhibitors. J Med Chem 52:3689-702 (2009)  
Target
Name:
Renin
Synonyms:
Angiotensinogenase RENI_HUMAN
Type:
Enzyme
Mol. Mass.:
45058.99
Organism:
Homo sapiens (Human)
Description:
Residue:
406
  
Inhibitor
Name:
BDBM50259461
Synonyms:
(1R,5S)-7-{2-[2-(2,6-Dichloro-4-methyl-phenoxy)-ethoxy]-thiazol-5-yl}-3,9-diaza-bicyclo[3.3.1]-non-6-ene-6-carboxylic acid cyclopropyl-(2,3-dimethyl-benzyl)-amide | CHEMBL505635
Type:
Small organic molecule
Emp. Form.:
C32H36Cl2N4O3S
Mol. Mass.:
627.624
SMILES:
Cc1cc(Cl)c(OCCOc2ncc(s2)C2=C([C@H]3CNC[C@@H](C2)N3)C(=O)N(Cc2cccc(C)c2C)C2CC2)c(Cl)c1
: