Target
Inosine-5'-monophosphate dehydrogenase
Ligand
BDBM50378051
Substrate
Meas. Tech.
ChEMBL_571747 (CHEMBL1032992)
IC50
1640±n/a nM
Citation
 Maurya, SKGollapalli, DRKirubakaran, SZhang, MJohnson, CRBenjamin, NNHedstrom, LCuny, GD Triazole inhibitors of Cryptosporidium parvum inosine 5'-monophosphate dehydrogenase. J Med Chem 52:4623-30 (2009)  
Target
Name:
Inosine-5'-monophosphate dehydrogenase
Synonyms:
Cgd6_20 protein Inosine-5'-monophosphate dehydrogenase, probable | Inosine-5-monophosphate dehydrogenase (IMPDH)
Type:
Protein
Mol. Mass.:
43076.80
Organism:
Cryptosporidium parvum
Description:
Q8T6T2
Residue:
400
  
Inhibitor
Name:
BDBM50378051
Synonyms:
CHEMBL561635
Type:
Small organic molecule
Emp. Form.:
C19H16ClNO2
Mol. Mass.:
325.789
SMILES:
CC(Oc1cccc2ccccc12)C(=O)Nc1ccc(Cl)cc1
: