Target
Somatostatin receptor type 1
Ligand
BDBM50294236
Substrate
Meas. Tech.
ChEMBL_575180 (CHEMBL1024527)
IC50
2.5±n/a nM
Citation
 Erchegyi, JCescato, RGrace, CRWaser, BPiccand, VHoyer, DRiek, RRivier, JEReubi, JC Novel, potent, and radio-iodinatable somatostatin receptor 1 (sst1) selective analogues. J Med Chem 52:2733-46 (2009)  
Target
Name:
Somatostatin receptor type 1
Synonyms:
SOMATOSTATIN SST1 SS-1-R SS1R SSTR1 | Somatostatin receptor type 1 (SSTR1)
Type:
Enzyme
Mol. Mass.:
42692.81
Organism:
Homo sapiens (Human)
Description:
P30872
Residue:
391
  
Inhibitor
Name:
BDBM50294236
Synonyms:
(4R,7S,10S,13S,16S,19S,22R,25S,28S,31S,34R)-34-amino-31-(4-aminobutyl)-25,28-dibenzyl-13-[(4-hydroxy-3-iodophenyl)methyl]-10,16-bis[(1R)-1-hydroxyethyl]-7-(hydroxymethyl)-22-(1H-indol-3-ylmethyl)-6,9,12,15,18,21,24,27,30,33-decaoxo-19-({4-[(propan-2-ylamino)methyl]phenyl}methyl)-1,2-dithia-5,8,11,14,17,20,23,26,29,32-decaazacyclopentatriacontane-4-carboxamide | CHEMBL559022
Type:
Small organic molecule
Emp. Form.:
C74H96IN15O15S2
Mol. Mass.:
1626.68
SMILES:
CC(C)NCc1ccc(C[C@@H]2NC(=O)[C@@H](Cc3c[nH]c4ccccc34)NC(=O)[C@H](Cc3ccccc3)NC(=O)[C@H](Cc3ccccc3)NC(=O)[C@H](CCCCN)NC(=O)[C@@H](N)CSSC[C@H](NC(=O)[C@H](CO)NC(=O)[C@@H](NC(=O)[C@H](Cc3ccc(O)c(I)c3)NC(=O)[C@@H](NC2=O)[C@@H](C)O)[C@@H](C)O)C(N)=O)cc1
: