Target
Glutamate receptor ionotropic, kainate 1
Ligand
BDBM50295042
Substrate
Meas. Tech.
ChEMBL_573963 (CHEMBL1062124)
EC50
660±n/a nM
Citation
 Clausen, RPNaur, PKristensen, ASGreenwood, JRStrange, MBräuner-Osborne, HJensen, AANielsen, ASGeneser, URinggaard, LMNielsen, BPickering, DSBrehm, LGajhede, MKrogsgaard-Larsen, PKastrup, JS The glutamate receptor GluR5 agonist (S)-2-amino-3-(3-hydroxy-7,8-dihydro-6H-cyclohepta[d]isoxazol-4-yl)propionic acid and the 8-methyl analogue: synthesis, molecular pharmacology, and biostructural characterization. J Med Chem 52:4911-22 (2009)  
Target
Name:
Glutamate receptor ionotropic, kainate 1
Synonyms:
GRIK1_RAT Glutamate receptor ionotropic kainate 1 Glutamate receptor, ionotropic kainate 1 Grik1
Type:
Enzyme Catalytic Domain
Mol. Mass.:
107860.82
Organism:
RAT
Description:
P22756
Residue:
949
  
Inhibitor
Name:
BDBM50295042
Synonyms:
(S)-2-Amino-3-((RS)-3-hydroxy-8-methyl-7,8-dihydro-6H-cyclohepta-[d]isoxazol-4-yl)propionic acid | CHEMBL553028
Type:
Small organic molecule
Emp. Form.:
C12H16N2O4
Mol. Mass.:
252.2664
SMILES:
CC1CCC=C(C[C@H](N)C(O)=O)c2c1o[nH]c2=O
: