Target
Mitogen-activated protein kinase
Ligand
BDBM13336
Substrate
Meas. Tech.
ChEMBL_580262 (CHEMBL1058805)
IC50
100±n/a nM
Citation
 Wei, SDaniel, BJBrumlik, MJBurow, MEZou, WKhan, IAWadsworth, SSiekierka, JCuriel, TJ Drugs designed to inhibit human p38 mitogen-activated protein kinase activation treat Toxoplasma gondii and Encephalitozoon cuniculi infection. Antimicrob Agents Chemother 51:4324-8 (2007)  
Target
Name:
Mitogen-activated protein kinase
Synonyms:
Mitogen-activated protein kinase 1
Type:
PROTEIN
Mol. Mass.:
58376.75
Organism:
Toxoplasma gondii
Description:
ChEMBL_580262
Residue:
532
  
Inhibitor
Name:
BDBM13336
Synonyms:
4-[4-(4-fluorophenyl)-2-(4-methanesulfinylphenyl)-1H-imidazol-5-yl]pyridine 4-{4-(4-fluorophenyl)-2-[4-(methylsulfinyl)phenyl]-1H-imidazol-5-yl}pyridine SB-203580 cid_176155
Type:
Small organic molecule
Emp. Form.:
C21H16FN3OS
Mol. Mass.:
377.435
SMILES:
CS(=O)c1ccc(cc1)-c1nc(c([nH]1)-c1ccc(F)cc1)-c1ccncc1
: