Target
Neuronal acetylcholine receptor subunit alpha-3
Ligand
BDBM50296748
Substrate
Meas. Tech.
ChEMBL_582488 (CHEMBL1058165)
IC50
4910±n/a nM
Citation
 O'Donnell, CJPeng, LO'Neill, BTArnold, EPMather, RJSands, SBShrikhande, ALebel, LASpracklin, DKNedza, FM Synthesis and SAR studies of 1,4-diazabicyclo[3.2.2]nonane phenyl carbamates--subtype selective, high affinity alpha7 nicotinic acetylcholine receptor agonists. Bioorg Med Chem Lett 19:4747-51 (2009)  
Target
Name:
Neuronal acetylcholine receptor subunit alpha-3
Synonyms:
ACHA3_HUMAN Cholinergic, Nicotinic Alpha3Beta2 Cholinergic, Nicotinic Alpha3Beta4x NACHRA3 Neuronal acetylcholine receptor subunit alpha-3 nicotinic central
Type:
Enzyme Catalytic Domain
Mol. Mass.:
57479.03
Organism:
Homo sapiens (Human)
Description:
Cholinergic, Nicotinic Alpha3Beta2 0 HUMAN::P32297
Residue:
505
  
Inhibitor
Name:
BDBM50296748
Synonyms:
CHEMBL564850 | naphthalen-2-yl 1,4-diazabicyclo[3.2.2]nonane-4-carboxylate
Type:
Small organic molecule
Emp. Form.:
C18H20N2O2
Mol. Mass.:
296.3636
SMILES:
O=C(Oc1ccc2ccccc2c1)N1CCN2CCC1CC2
: