Target
5-hydroxytryptamine receptor 1A
Ligand
BDBM50098551
Substrate
Meas. Tech.
ChEMBL_584472 (CHEMBL1059151)
Ki
>10000±n/a nM
Citation
 Zajdel, PSubra, GVerdie, PGabzdyl, EBojarski, AJDuszynska, BMartinez, JPawlowski, M Sulfonamides with the N-alkyl-N'-dialkylguanidine moiety as 5-HT7 receptor ligands. Bioorg Med Chem Lett 19:4827-31 (2009)  
Target
Name:
5-hydroxytryptamine receptor 1A
Synonyms:
5-HT-1A 5-HT1A 5-hydroxytryptamine receptor 1A (5HT1A) 5ht1a Htr1a Serotonin 1a (5-HT1a) receptor/Adrenergic receptor alpha-1 | Serotonin receptor 1A
Type:
G Protein-Coupled Receptor (GPCR)
Mol. Mass.:
46445.29
Organism:
Rattus norvegicus (rat)
Description:
Binding assays were performed using rat hippocampal membranes.
Residue:
422
  
Inhibitor
Name:
BDBM50098551
Synonyms:
(R)-3-(2-(2-(4-methylpiperidin-1-yl)ethyl)pyrrolidin-1-ylsulfonyl)phenol 3-{(R)-2-[2-(4-Methyl-piperidin-1-yl)-ethyl]-pyrrolidine-1-sulfonyl}-phenol 3-{2-[2-(4-Methyl-piperidin-1-yl)-ethyl]-pyrrolidine-1-sulfonyl}-phenol CHEMBL282199 | SB-269970
Type:
Small organic molecule
Emp. Form.:
C18H28N2O3S
Mol. Mass.:
352.492
SMILES:
CC1CCN(CC[C@H]2CCCN2S(=O)(=O)c2cccc(O)c2)CC1
: