Target
5-hydroxytryptamine receptor 2A
Ligand
BDBM50261126
Substrate
Meas. Tech.
ChEMBL_584473 (CHEMBL1059152)
Ki
85±n/a nM
Citation
 Zajdel, PSubra, GVerdie, PGabzdyl, EBojarski, AJDuszynska, BMartinez, JPawlowski, M Sulfonamides with the N-alkyl-N'-dialkylguanidine moiety as 5-HT7 receptor ligands. Bioorg Med Chem Lett 19:4827-31 (2009)  
Target
Name:
5-hydroxytryptamine receptor 2A
Synonyms:
5-HT-2A 5-HT2A 5-hydroxytryptamine receptor 2A (5HT2A) Htr2 Serotonin Receptor 2A
Type:
G Protein-Coupled Receptor (GPCR)
Mol. Mass.:
52852.05
Organism:
Rattus norvegicus (rat)
Description:
Rat cortex membranes 5-HT2A receptors.
Residue:
471
  
Inhibitor
Name:
BDBM50261126
Synonyms:
CHEMBL497749 Naphthalene-2-sulfonic acid {3-[4-(2-methoxyphenyl)-piperazin-1-yl]-propyl}-amide
Type:
Small organic molecule
Emp. Form.:
C24H29N3O3S
Mol. Mass.:
439.57
SMILES:
COc1ccccc1N1CCN(CCCNS(=O)(=O)c2ccc3ccccc3c2)CC1
: