Target
Sodium-dependent noradrenaline transporter
Ligand
BDBM50302922
Substrate
Meas. Tech.
ChEMBL_595697 (CHEMBL1041760)
Ki
4600±n/a nM
Citation
 Carroll, FIBlough, BEAbraham, PMills, ACHolleman, JAWolckenhauer, SADecker, AMLandavazo, AMcElroy, KTNavarro, HAGatch, MBForster, MJ Synthesis and biological evaluation of bupropion analogues as potential pharmacotherapies for cocaine addiction. J Med Chem 52:6768-81 (2009)  
Target
Name:
Sodium-dependent noradrenaline transporter
Synonyms:
Monoamine transporter NET Noradrenaline Transporter (NET) Norepinephrine transporter protein (NET) SLC6A2 Sodium-dependent noradrenaline transporter (NET) | Solute carrier family 6 member 2
Type:
Multi-pass membrane protein
Mol. Mass.:
69337.72
Organism:
Homo sapiens (Human)
Description:
P23975
Residue:
617
  
Inhibitor
Name:
BDBM50302922
Synonyms:
1-(4-bromo-3-methylphenyl)-2-(tert-butylamino)propan-1-one CHEMBL565845
Type:
Small organic molecule
Emp. Form.:
C14H20BrNO
Mol. Mass.:
298.219
SMILES:
CC(NC(C)(C)C)C(=O)c1ccc(Br)c(C)c1
: