Target
Sodium-dependent noradrenaline transporter
Ligand
BDBM50302921
Substrate
Meas. Tech.
ChEMBL_595697 (CHEMBL1041760)
Ki
4300±n/a nM
Citation
 Carroll, FIBlough, BEAbraham, PMills, ACHolleman, JAWolckenhauer, SADecker, AMLandavazo, AMcElroy, KTNavarro, HAGatch, MBForster, MJ Synthesis and biological evaluation of bupropion analogues as potential pharmacotherapies for cocaine addiction. J Med Chem 52:6768-81 (2009)  
Target
Name:
Sodium-dependent noradrenaline transporter
Synonyms:
Monoamine transporter NET Noradrenaline Transporter (NET) Norepinephrine transporter protein (NET) SLC6A2 Sodium-dependent noradrenaline transporter (NET) | Solute carrier family 6 member 2
Type:
Multi-pass membrane protein
Mol. Mass.:
69337.72
Organism:
Homo sapiens (Human)
Description:
P23975
Residue:
617
  
Inhibitor
Name:
BDBM50302921
Synonyms:
2-(N-tert-Butylamino)-3'-chloroheptanophenone | CHEMBL565382
Type:
Small organic molecule
Emp. Form.:
C17H26ClNO
Mol. Mass.:
295.847
SMILES:
CCCCCC(NC(C)(C)C)C(=O)c1cccc(Cl)c1
: