Target
Sodium-dependent serotonin transporter
Ligand
BDBM50302916
Substrate
Meas. Tech.
ChEMBL_595696 (CHEMBL1041759)
Ki
>10000±n/a nM
Citation
 Carroll, FIBlough, BEAbraham, PMills, ACHolleman, JAWolckenhauer, SADecker, AMLandavazo, AMcElroy, KTNavarro, HAGatch, MBForster, MJ Synthesis and biological evaluation of bupropion analogues as potential pharmacotherapies for cocaine addiction. J Med Chem 52:6768-81 (2009)  
Target
Name:
Sodium-dependent serotonin transporter
Synonyms:
5-HT Transporter 5HTT SC6A4_HUMAN SLC6A4 Serotonin transporter (5HTT) Sodium-dependent serotonin transporter (SERT) | Solute carrier family 6 member 4
Type:
Multi-pass membrane protein
Mol. Mass.:
70322.51
Organism:
Homo sapiens (Human)
Description:
P31645
Residue:
630
  
Inhibitor
Name:
BDBM50302916
Synonyms:
1-(3-chlorophenyl)-2-(cyclopentylamino)propan-1-one CHEMBL566618
Type:
Small organic molecule
Emp. Form.:
C14H18ClNO
Mol. Mass.:
251.752
SMILES:
CC(NC1CCCC1)C(=O)c1cccc(Cl)c1
: