Target
Sodium-dependent serotonin transporter
Ligand
BDBM50302913
Substrate
Meas. Tech.
ChEMBL_595699 (CHEMBL1041762)
IC50
>10000±n/a nM
Citation
 Carroll, FIBlough, BEAbraham, PMills, ACHolleman, JAWolckenhauer, SADecker, AMLandavazo, AMcElroy, KTNavarro, HAGatch, MBForster, MJ Synthesis and biological evaluation of bupropion analogues as potential pharmacotherapies for cocaine addiction. J Med Chem 52:6768-81 (2009)  
Target
Name:
Sodium-dependent serotonin transporter
Synonyms:
5-HT Transporter 5HTT SC6A4_HUMAN SLC6A4 Serotonin transporter (5HTT) Sodium-dependent serotonin transporter (SERT) | Solute carrier family 6 member 4
Type:
Multi-pass membrane protein
Mol. Mass.:
70322.51
Organism:
Homo sapiens (Human)
Description:
P31645
Residue:
630
  
Inhibitor
Name:
BDBM50302913
Synonyms:
2-(N-tert-Butylamino)-3'-chlorophenyl-4-methylpentanophenone | CHEMBL565594
Type:
Small organic molecule
Emp. Form.:
C16H24ClNO
Mol. Mass.:
281.821
SMILES:
CC(C)CC(NC(C)(C)C)C(=O)c1cccc(Cl)c1
: