Target
Sodium-dependent dopamine transporter
Ligand
BDBM50302920
Substrate
Meas. Tech.
ChEMBL_595695 (CHEMBL1041758)
Ki
3980±n/a nM
Citation
 Carroll, FIBlough, BEAbraham, PMills, ACHolleman, JAWolckenhauer, SADecker, AMLandavazo, AMcElroy, KTNavarro, HAGatch, MBForster, MJ Synthesis and biological evaluation of bupropion analogues as potential pharmacotherapies for cocaine addiction. J Med Chem 52:6768-81 (2009)  
Target
Name:
Sodium-dependent dopamine transporter
Synonyms:
DA transporter DAT1 Dopamine transporter protein (DAT) SC6A3_HUMAN Sodium-dependent dopamine transporter Solute carrier family 6 member 3
Type:
Multi-pass membrane protein
Mol. Mass.:
68497.11
Organism:
Homo sapiens (Human)
Description:
Q01959
Residue:
620
  
Inhibitor
Name:
BDBM50302920
Synonyms:
2-(N-Isopropylamino)-3'-chloropropiophenone | CHEMBL565397
Type:
Small organic molecule
Emp. Form.:
C12H16ClNO
Mol. Mass.:
225.715
SMILES:
CC(C)NC(C)C(=O)c1cccc(Cl)c1
: