Target
Serine/threonine-protein kinase PAK 5
Ligand
BDBM50326053
Substrate
Meas. Tech.
ChEMBL_586853 (CHEMBL1051348)
Kd
>10000±n/a nM
Citation
 Karaman, MWHerrgard, STreiber, DKGallant, PAtteridge, CECampbell, BTChan, KWCiceri, PDavis, MIEdeen, PTFaraoni, RFloyd, MHunt, JPLockhart, DJMilanov, ZVMorrison, MJPallares, GPatel, HKPritchard, SWodicka, LMZarrinkar, PP A quantitative analysis of kinase inhibitor selectivity. Nat Biotechnol 26:127-32 (2008)  
Target
Name:
Serine/threonine-protein kinase PAK 5
Synonyms:
KIAA1264 PAK5_HUMAN PAK7/PAK5 Serine/threonine-protein kinase (PAK7) Serine/threonine-protein kinase PAK7
Type:
Protein
Mol. Mass.:
80760.58
Organism:
Homo sapiens (Human)
Description:
Q9P286
Residue:
719
  
Inhibitor
Name:
BDBM50326053
Synonyms:
CHEMBL608533 | PKC-412
Type:
Small organic molecule
Emp. Form.:
C35H30N4O4
Mol. Mass.:
570.6371
SMILES:
CO[C@@H]1[C@@H](C[C@H]2O[C@]1(C)n1c3ccccc3c3c4CNC(=O)c4c4c5ccccc5n2c4c13)N(C)C(=O)c1ccccc1
: