Target
Ribosomal protein S6 kinase alpha-5
Ligand
BDBM5931
Substrate
Meas. Tech.
ChEMBL_587217 (CHEMBL1056938)
Kd
>10000±n/a nM
Citation
 Karaman, MWHerrgard, STreiber, DKGallant, PAtteridge, CECampbell, BTChan, KWCiceri, PDavis, MIEdeen, PTFaraoni, RFloyd, MHunt, JPLockhart, DJMilanov, ZVMorrison, MJPallares, GPatel, HKPritchard, SWodicka, LMZarrinkar, PP A quantitative analysis of kinase inhibitor selectivity. Nat Biotechnol 26:127-32 (2008)  
Target
Name:
Ribosomal protein S6 kinase alpha-5
Synonyms:
90 kDa ribosomal protein S6 kinase 5 MSK1 Nuclear mitogen- and stress-activated protein kinase 1 RPS6KA5 RSK-like protein kinase Ribosomal protein S6 kinase Ribosomal protein S6 kinase alpha-5
Type:
Serine/threonine-protein kinase
Mol. Mass.:
89874.44
Organism:
Homo sapiens (Human)
Description:
Residue:
802
  
Inhibitor
Name:
BDBM5931
Synonyms:
BMS-387072 N-(5-{[(5-tert-butyl-1,3-oxazol-2-yl)methyl]sulfanyl}-1,3-thiazol-2-yl)piperidine-4-carboxamide cid_3025986
Type:
Small organic molecule
Emp. Form.:
C17H24N4O2S2
Mol. Mass.:
380.528
SMILES:
CC(C)(C)c1cnc(CSc2cnc(NC(=O)C3CCNCC3)s2)o1
: