Target
Serine/threonine-protein kinase tousled-like 2
Ligand
BDBM50110208
Substrate
Meas. Tech.
ChEMBL_587220 (CHEMBL1061984)
Kd
>10000±n/a nM
Citation
 Karaman, MWHerrgard, STreiber, DKGallant, PAtteridge, CECampbell, BTChan, KWCiceri, PDavis, MIEdeen, PTFaraoni, RFloyd, MHunt, JPLockhart, DJMilanov, ZVMorrison, MJPallares, GPatel, HKPritchard, SWodicka, LMZarrinkar, PP A quantitative analysis of kinase inhibitor selectivity. Nat Biotechnol 26:127-32 (2008)  
Target
Name:
Serine/threonine-protein kinase tousled-like 2
Synonyms:
Serine/threonine-protein kinase tousled-like 2 TLK2_HUMAN
Type:
PROTEIN
Mol. Mass.:
87680.67
Organism:
Homo sapiens (Human)
Description:
ChEMBL_1510767
Residue:
772
  
Inhibitor
Name:
BDBM50110208
Synonyms:
4-(4-(benzo[d][1,3]dioxol-5-yl)-5-(pyridin-2-yl)-1H-imidazol-2-yl)benzamide 4-(5-(benzo[d][1,3]dioxol-5-yl)-4-(pyridin-2-yl)-1H-imidazol-2-yl)benzamide CHEMBL440084 cid_4521392
Type:
Small organic molecule
Emp. Form.:
C22H16N4O3
Mol. Mass.:
384.3874
SMILES:
NC(=O)c1ccc(cc1)-c1nc(c([nH]1)-c1ccc2OCOc2c1)-c1ccccn1
: