Target
Mitogen-activated protein kinase 6
Ligand
BDBM31090
Substrate
Meas. Tech.
ChEMBL_586455 (CHEMBL1063710)
Kd
>10000±n/a nM
Citation
 Karaman, MWHerrgard, STreiber, DKGallant, PAtteridge, CECampbell, BTChan, KWCiceri, PDavis, MIEdeen, PTFaraoni, RFloyd, MHunt, JPLockhart, DJMilanov, ZVMorrison, MJPallares, GPatel, HKPritchard, SWodicka, LMZarrinkar, PP A quantitative analysis of kinase inhibitor selectivity. Nat Biotechnol 26:127-32 (2008)  
Target
Name:
Mitogen-activated protein kinase 6
Synonyms:
ERK3 MK06_HUMAN | PRKM6
Type:
PROTEIN
Mol. Mass.:
82643.07
Organism:
Homo sapiens (Human)
Description:
ChEMBL_774367
Residue:
721
  
Inhibitor
Name:
BDBM31090
Synonyms:
(E)-N-[4-(3-chloro-4-fluoro-anilino)-3-cyano-7-ethoxy-6-quinolyl]-4-(dimethylamino)but-2-enamide (E)-N-[4-(3-chloro-4-fluoroanilino)-3-cyano-7-ethoxyquinolin-6-yl]-4-(dimethylamino)but-2-enamide EKB-569 cid_6445562
Type:
Small organic molecule
Emp. Form.:
C24H23ClFN5O2
Mol. Mass.:
467.923
SMILES:
CCOc1cc2ncc(C#N)c(Nc3ccc(F)c(Cl)c3)c2cc1NC(=O)\C=C\CN(C)C
: