Target
Cyclin-dependent kinase 19
Ligand
BDBM26300
Substrate
Meas. Tech.
ChEMBL_586688 (CHEMBL1062837)
Kd
>10000±n/a nM
Citation
 Karaman, MWHerrgard, STreiber, DKGallant, PAtteridge, CECampbell, BTChan, KWCiceri, PDavis, MIEdeen, PTFaraoni, RFloyd, MHunt, JPLockhart, DJMilanov, ZVMorrison, MJPallares, GPatel, HKPritchard, SWodicka, LMZarrinkar, PP A quantitative analysis of kinase inhibitor selectivity. Nat Biotechnol 26:127-32 (2008)  
Target
Name:
Cyclin-dependent kinase 19
Synonyms:
CDC2-related protein kinase 6 CDK11 CDK19_HUMAN Cell division protein kinase 19 Death-preventing kinase | KIAA1028
Type:
Serine/Threonine protein kinase
Mol. Mass.:
56816.68
Organism:
Homo sapiens (Human)
Description:
Q9BWU1
Residue:
502
  
Inhibitor
Name:
BDBM26300
Synonyms:
2-{3-[(7-{3-[ethyl(2-hydroxyethyl)amino]propoxy}quinazolin-4-yl)amino]-1H-pyrazol-5-yl}-N-(3-fluorophenyl)acetamide cid_16007391 | pyrazoloquinazoline deriv., 34
Type:
Small organic molecule
Emp. Form.:
C26H30FN7O3
Mol. Mass.:
507.5599
SMILES:
CCN(CCO)CCCOc1ccc2c(Nc3cc(CC(=O)Nc4cccc(F)c4)n[nH]3)ncnc2c1
: