Target
Serine/threonine-protein kinase MRCK gamma
Ligand
BDBM24773
Substrate
Meas. Tech.
ChEMBL_587179 (CHEMBL1060242)
Kd
>10000±n/a nM
Citation
 Karaman, MWHerrgard, STreiber, DKGallant, PAtteridge, CECampbell, BTChan, KWCiceri, PDavis, MIEdeen, PTFaraoni, RFloyd, MHunt, JPLockhart, DJMilanov, ZVMorrison, MJPallares, GPatel, HKPritchard, SWodicka, LMZarrinkar, PP A quantitative analysis of kinase inhibitor selectivity. Nat Biotechnol 26:127-32 (2008)  
Target
Name:
Serine/threonine-protein kinase MRCK gamma
Synonyms:
CDC42-binding protein kinase gamma DMPK-like gamma MRCK gamma MRCKG_HUMAN Myotonic dystrophy protein kinase-like alpha | Myotonic dystrophy protein kinase-like gamma
Type:
PROTEIN
Mol. Mass.:
172450.18
Organism:
Homo sapiens (Human)
Description:
ChEMBL_774587
Residue:
1551
  
Inhibitor
Name:
BDBM24773
Synonyms:
AMG 706 Motesanib N-(3,3-dimethyl-1,2-dihydroindol-6-yl)-2-(pyridin-4-ylmethylamino)pyridine-3-carboxamide N-(3,3-dimethylindolin-6-yl)-2-(4-pyridylmethylamino)nicotinamide cid_11667893
Type:
Small organic molecule
Emp. Form.:
C22H23N5O
Mol. Mass.:
373.4509
SMILES:
CC1(C)CNc2cc(NC(=O)c3cccnc3NCc3ccncc3)ccc12
: