Target
Calcium/calmodulin-dependent protein kinase kinase 1
Ligand
BDBM21079
Substrate
Meas. Tech.
ChEMBL_586687 (CHEMBL1062836)
Kd
>10000±n/a nM
Citation
 Karaman, MWHerrgard, STreiber, DKGallant, PAtteridge, CECampbell, BTChan, KWCiceri, PDavis, MIEdeen, PTFaraoni, RFloyd, MHunt, JPLockhart, DJMilanov, ZVMorrison, MJPallares, GPatel, HKPritchard, SWodicka, LMZarrinkar, PP A quantitative analysis of kinase inhibitor selectivity. Nat Biotechnol 26:127-32 (2008)  
Target
Name:
Calcium/calmodulin-dependent protein kinase kinase 1
Synonyms:
CAMKK1 CaM-kinase kinase alpha | KKCC1_HUMAN
Type:
PROTEIN
Mol. Mass.:
55727.76
Organism:
Homo sapiens (Human)
Description:
ChEMBL_774623
Residue:
505
  
Inhibitor
Name:
BDBM21079
Synonyms:
1-[4-(3-amino-1H-indazol-4-yl)phenyl]-3-(2-fluoro-5-methyl-phenyl)urea 1-[4-(3-azanyl-1H-indazol-4-yl)phenyl]-3-(2-fluoranyl-5-methyl-phenyl)urea ABT-869 CHEMBL223360 | cid_11485656
Type:
Small organic molecule
Emp. Form.:
C21H18FN5O
Mol. Mass.:
375.3989
SMILES:
Cc1ccc(F)c(NC(=O)Nc2ccc(cc2)-c2cccc3[nH]nc(N)c23)c1
: