Target
Mitogen-activated protein kinase kinase kinase 10
Ligand
BDBM5446
Substrate
Meas. Tech.
ChEMBL_586598 (CHEMBL1061177)
Kd
>10000±n/a nM
Citation
 Karaman, MWHerrgard, STreiber, DKGallant, PAtteridge, CECampbell, BTChan, KWCiceri, PDavis, MIEdeen, PTFaraoni, RFloyd, MHunt, JPLockhart, DJMilanov, ZVMorrison, MJPallares, GPatel, HKPritchard, SWodicka, LMZarrinkar, PP A quantitative analysis of kinase inhibitor selectivity. Nat Biotechnol 26:127-32 (2008)  
Target
Name:
Mitogen-activated protein kinase kinase kinase 10
Synonyms:
M3K10_HUMAN MLK2 Mitogen-activated protein kinase kinase kinase 10 | Mixed Lineage Kinase 2 (MLK2)
Type:
PROTEIN
Mol. Mass.:
103699.30
Organism:
Homo sapiens (Human)
Description:
ChEMBL_1460564
Residue:
954
  
Inhibitor
Name:
BDBM5446
Synonyms:
CHEMBL553 Erlotinib N-(3-Ethynylphenyl)-6,7-bis(2-methoxyethoxy)-4-quinazolinamine Monohydrochloride OSI-774 US10189853, erlotinib US11524945, Compound Erlotinib US9730934, Erlotinib cid_176870
Type:
Small organic molecule
Emp. Form.:
C22H23N3O4
Mol. Mass.:
393.4357
SMILES:
COCCOc1cc2ncnc(Nc3cccc(c3)C#C)c2cc1OCCOC
: