Target
Bone morphogenetic protein receptor type-1A
Ligand
BDBM26474
Substrate
Meas. Tech.
ChEMBL_586442 (CHEMBL1063699)
Kd
>10000±n/a nM
Citation
 Karaman, MWHerrgard, STreiber, DKGallant, PAtteridge, CECampbell, BTChan, KWCiceri, PDavis, MIEdeen, PTFaraoni, RFloyd, MHunt, JPLockhart, DJMilanov, ZVMorrison, MJPallares, GPatel, HKPritchard, SWodicka, LMZarrinkar, PP A quantitative analysis of kinase inhibitor selectivity. Nat Biotechnol 26:127-32 (2008)  
Target
Name:
Bone morphogenetic protein receptor type-1A
Synonyms:
ACVRLK3 Activin receptor-like kinase 3 (ALK-3) BMR1A_HUMAN
Type:
Enzyme
Mol. Mass.:
60204.46
Organism:
Homo sapiens (Human)
Description:
P36894
Residue:
532
  
Inhibitor
Name:
BDBM26474
Synonyms:
5-({4-[(2,3-dimethyl-2H-indazol-6-yl)(methyl)amino]pyrimidin-2-yl}amino)-2-methylbenzene-1-sulfonamide JMC514632 Compound 13 cid_10113978
Type:
Small organic molecule
Emp. Form.:
C21H23N7O2S
Mol. Mass.:
437.518
SMILES:
CN(c1ccc2c(C)n(C)nc2c1)c1ccnc(Nc2ccc(C)c(c2)S(N)(=O)=O)n1
: