Target
Serine/threonine-protein kinase BRSK1
Ligand
BDBM4814
Substrate
Meas. Tech.
ChEMBL_586948 (CHEMBL1061135)
Kd
3500±n/a nM
Citation
 Karaman, MWHerrgard, STreiber, DKGallant, PAtteridge, CECampbell, BTChan, KWCiceri, PDavis, MIEdeen, PTFaraoni, RFloyd, MHunt, JPLockhart, DJMilanov, ZVMorrison, MJPallares, GPatel, HKPritchard, SWodicka, LMZarrinkar, PP A quantitative analysis of kinase inhibitor selectivity. Nat Biotechnol 26:127-32 (2008)  
Target
Name:
Serine/threonine-protein kinase BRSK1
Synonyms:
BR serine/threonine-protein kinase 1 BRSK1_HUMAN SAD1 Serine/threonine-protein kinase BRSK1 (BRSK1)
Type:
Enzyme Catalytic Domain
Mol. Mass.:
85119.02
Organism:
Homo sapiens (Human)
Description:
gi_24308326
Residue:
778
  
Inhibitor
Name:
BDBM4814
Synonyms:
CHEMBL535 N-[2-(diethylamino)ethyl]-5-{[(3Z)-5-fluoro-2-oxo-2,3-dihydro-1H-indol-3-ylidene]methyl}-2,4-dimethyl-1H-pyrrole-3-carboxamide SUNITINIB US10464902, Sunitinib US9914707, SU11248
Type:
Small organic molecule
Emp. Form.:
C22H27FN4O2
Mol. Mass.:
398.4738
SMILES:
CCN(CC)CCNC(=O)c1c(C)[nH]c(\C=C2/C(=O)Nc3ccc(F)cc23)c1C
: