Target
Tyrosine-protein kinase Lck
Ligand
BDBM21
Substrate
Meas. Tech.
ChEMBL_586842 (CHEMBL1051337)
Kd
17±n/a nM
Citation
 Karaman, MWHerrgard, STreiber, DKGallant, PAtteridge, CECampbell, BTChan, KWCiceri, PDavis, MIEdeen, PTFaraoni, RFloyd, MHunt, JPLockhart, DJMilanov, ZVMorrison, MJPallares, GPatel, HKPritchard, SWodicka, LMZarrinkar, PP A quantitative analysis of kinase inhibitor selectivity. Nat Biotechnol 26:127-32 (2008)  
Target
Name:
Tyrosine-protein kinase Lck
Synonyms:
2.7.10.2 LCK_HUMAN Leukocyte C-terminal Src kinase Lymphocyte-specific protein tyrosine kinase Protein YT16 Proto-oncogene tyrosine-protein kinase LCK T cell-specific protein-tyrosine kinase
Type:
Mol. Mass.:
57987.83
Organism:
Homo sapiens (Human)
Description:
P06239
Residue:
509
  
Inhibitor
Name:
BDBM21
Synonyms:
CHEMBL24828 VANDETANIB ZD6474 | cid_3081361
Type:
Emp. Form.:
C22H24BrFN4O2
Mol. Mass.:
475.354
SMILES:
COc1cc2c(Nc3ccc(Br)cc3F)ncnc2cc1OCC1CCN(C)CC1
: