Target
Serine/threonine-protein kinase BRSK2
Ligand
BDBM15244
Substrate
Meas. Tech.
ChEMBL_586949 (CHEMBL1061136)
Kd
>10000±n/a nM
Citation
 Karaman, MWHerrgard, STreiber, DKGallant, PAtteridge, CECampbell, BTChan, KWCiceri, PDavis, MIEdeen, PTFaraoni, RFloyd, MHunt, JPLockhart, DJMilanov, ZVMorrison, MJPallares, GPatel, HKPritchard, SWodicka, LMZarrinkar, PP A quantitative analysis of kinase inhibitor selectivity. Nat Biotechnol 26:127-32 (2008)  
Target
Name:
Serine/threonine-protein kinase BRSK2
Synonyms:
BR serine/threonine-protein kinase 2 BRSK2_HUMAN PEN11B STK29
Type:
PROTEIN
Mol. Mass.:
81657.07
Organism:
Homo sapiens (Human)
Description:
ChEMBL_586949
Residue:
736
  
Inhibitor
Name:
BDBM15244
Synonyms:
5-(2,6-dichlorophenyl)-2-(2,4-difluorophenyl)sulfanylpyrimido[1,6-b]pyridazin-6-one 5-(2,6-dichlorophenyl)-2-[(2,4-difluorophenyl)thio]-6-pyrimido[1,6-b]pyridazinone 5-(2,6-dichlorophenyl)-9-(2,4-difluorophenyl)sulfanyl-1,3,10-triazabicyclo[4.4.0]deca-2,5,7,9-tetraen-4-one VX-745 cid_3038525
Type:
Small organic molecule
Emp. Form.:
C19H9Cl2F2N3OS
Mol. Mass.:
436.262
SMILES:
Fc1ccc(Sc2ccc3c(-c4c(Cl)cccc4Cl)c(=O)ncn3n2)c(F)c1
: