Target
Serine/threonine-protein kinase PAK 2
Ligand
BDBM21079
Substrate
Meas. Tech.
ChEMBL_586605 (CHEMBL1050828)
Kd
>10000±n/a nM
Citation
 Karaman, MWHerrgard, STreiber, DKGallant, PAtteridge, CECampbell, BTChan, KWCiceri, PDavis, MIEdeen, PTFaraoni, RFloyd, MHunt, JPLockhart, DJMilanov, ZVMorrison, MJPallares, GPatel, HKPritchard, SWodicka, LMZarrinkar, PP A quantitative analysis of kinase inhibitor selectivity. Nat Biotechnol 26:127-32 (2008)  
Target
Name:
Serine/threonine-protein kinase PAK 2
Synonyms:
PAK2 Serine/threonine-protein kinase PAK 1/PAK 2/PAK 3 Serine/threonine-protein kinase PAK 2 (PAK2) | p21-Activated kinase 2 (PAK2)
Type:
Enzyme
Mol. Mass.:
58037.40
Organism:
Homo sapiens (Human)
Description:
Q13177
Residue:
524
  
Inhibitor
Name:
BDBM21079
Synonyms:
1-[4-(3-amino-1H-indazol-4-yl)phenyl]-3-(2-fluoro-5-methyl-phenyl)urea 1-[4-(3-azanyl-1H-indazol-4-yl)phenyl]-3-(2-fluoranyl-5-methyl-phenyl)urea ABT-869 CHEMBL223360 | cid_11485656
Type:
Small organic molecule
Emp. Form.:
C21H18FN5O
Mol. Mass.:
375.3989
SMILES:
Cc1ccc(F)c(NC(=O)Nc2ccc(cc2)-c2cccc3[nH]nc(N)c23)c1
: