Target
Receptor-type tyrosine-protein kinase FLT3
Ligand
BDBM31085
Substrate
Meas. Tech.
ChEMBL_586328 (CHEMBL1061073)
Kd
2.3±n/a nM
Citation
 Karaman, MWHerrgard, STreiber, DKGallant, PAtteridge, CECampbell, BTChan, KWCiceri, PDavis, MIEdeen, PTFaraoni, RFloyd, MHunt, JPLockhart, DJMilanov, ZVMorrison, MJPallares, GPatel, HKPritchard, SWodicka, LMZarrinkar, PP A quantitative analysis of kinase inhibitor selectivity. Nat Biotechnol 26:127-32 (2008)  
Target
Name:
Receptor-type tyrosine-protein kinase FLT3
Synonyms:
CD135 FL cytokine receptor FLK2 FLT3 Fetal liver kinase-2 Fms-like tyrosine kinase 3 (Flt-3) STK-1 Stem cell tyrosine kinase 1
Type:
Enzyme
Mol. Mass.:
112888.62
Organism:
Homo sapiens (Human)
Description:
P36888
Residue:
993
  
Inhibitor
Name:
BDBM31085
Synonyms:
1-[4-[(4-ethyl-1-piperazinyl)methyl]-3-(trifluoromethyl)phenyl]-3-[4-[[6-(methylamino)-4-pyrimidinyl]oxy]phenyl]urea 1-[4-[(4-ethylpiperazino)methyl]-3-(trifluoromethyl)phenyl]-3-[4-[6-(methylamino)pyrimidin-4-yl]oxyphenyl]urea cid_11409972
Type:
Small organic molecule
Emp. Form.:
C26H30F3N7O2
Mol. Mass.:
529.5573
SMILES:
CCN1CCN(Cc2ccc(NC(=O)Nc3ccc(Oc4cc(NC)ncn4)cc3)cc2C(F)(F)F)CC1
: