Target
Cyclin-dependent kinase 11A
Ligand
BDBM5447
Substrate
Meas. Tech.
ChEMBL_586815 (CHEMBL1063794)
Kd
>10000±n/a nM
Citation
 Karaman, MWHerrgard, STreiber, DKGallant, PAtteridge, CECampbell, BTChan, KWCiceri, PDavis, MIEdeen, PTFaraoni, RFloyd, MHunt, JPLockhart, DJMilanov, ZVMorrison, MJPallares, GPatel, HKPritchard, SWodicka, LMZarrinkar, PP A quantitative analysis of kinase inhibitor selectivity. Nat Biotechnol 26:127-32 (2008)  
Target
Name:
Cyclin-dependent kinase 11A
Synonyms:
CD11A_HUMAN CDC2L3 Cell division cycle 2-like protein kinase 2 Galactosyltransferase-associated protein kinase p58/GTA PITSLREB
Type:
PROTEIN
Mol. Mass.:
91334.31
Organism:
Homo sapiens (Human)
Description:
ChEMBL_774613
Residue:
783
  
Inhibitor
Name:
BDBM5447
Synonyms:
CHEMBL939 Iressa N-(3-chloro-4-fluorophenyl)-7-methoxy-6-[3-(morpholin-4-yl)propoxy]quinazolin-4-amine US10507209, Compound Gefitinib US9730934, Gefitinib WO2022090481, Example gefitinib cid_123631
Type:
Small organic molecule
Emp. Form.:
C22H24ClFN4O3
Mol. Mass.:
446.902
SMILES:
COc1cc2ncnc(Nc3ccc(F)c(Cl)c3)c2cc1OCCCN1CCOCC1
: