Target
Atypical kinase COQ8B, mitochondrial
Ligand
BDBM5446
Substrate
Meas. Tech.
ChEMBL_586944 (CHEMBL1061132)
Kd
2500±n/a nM
Citation
 Karaman, MWHerrgard, STreiber, DKGallant, PAtteridge, CECampbell, BTChan, KWCiceri, PDavis, MIEdeen, PTFaraoni, RFloyd, MHunt, JPLockhart, DJMilanov, ZVMorrison, MJPallares, GPatel, HKPritchard, SWodicka, LMZarrinkar, PP A quantitative analysis of kinase inhibitor selectivity. Nat Biotechnol 26:127-32 (2008)  
Target
Name:
Atypical kinase COQ8B, mitochondrial
Synonyms:
ADCK4 COQ8B_HUMAN | Uncharacterized aarF domain-containing protein kinase 4
Type:
PROTEIN
Mol. Mass.:
60073.32
Organism:
Homo sapiens (Human)
Description:
ChEMBL_586944
Residue:
544
  
Inhibitor
Name:
BDBM5446
Synonyms:
CHEMBL553 Erlotinib N-(3-Ethynylphenyl)-6,7-bis(2-methoxyethoxy)-4-quinazolinamine Monohydrochloride OSI-774 US10189853, erlotinib US11524945, Compound Erlotinib US9730934, Erlotinib cid_176870
Type:
Small organic molecule
Emp. Form.:
C22H23N3O4
Mol. Mass.:
393.4357
SMILES:
COCCOc1cc2ncnc(Nc3cccc(c3)C#C)c2cc1OCCOC
: