Target
Serine/threonine-protein kinase PAK 3
Ligand
BDBM50110208
Substrate
Meas. Tech.
ChEMBL_586989 (CHEMBL1062779)
Kd
>10000±n/a nM
Citation
 Karaman, MWHerrgard, STreiber, DKGallant, PAtteridge, CECampbell, BTChan, KWCiceri, PDavis, MIEdeen, PTFaraoni, RFloyd, MHunt, JPLockhart, DJMilanov, ZVMorrison, MJPallares, GPatel, HKPritchard, SWodicka, LMZarrinkar, PP A quantitative analysis of kinase inhibitor selectivity. Nat Biotechnol 26:127-32 (2008)  
Target
Name:
Serine/threonine-protein kinase PAK 3
Synonyms:
OPHN3 PAK3_HUMAN Serine/threonine-protein kinase PAK 3 | p21-Activated kinase 3 (PAK3)
Type:
Enzyme
Mol. Mass.:
62298.33
Organism:
Homo sapiens (Human)
Description:
O75914
Residue:
559
  
Inhibitor
Name:
BDBM50110208
Synonyms:
4-(4-(benzo[d][1,3]dioxol-5-yl)-5-(pyridin-2-yl)-1H-imidazol-2-yl)benzamide 4-(5-(benzo[d][1,3]dioxol-5-yl)-4-(pyridin-2-yl)-1H-imidazol-2-yl)benzamide CHEMBL440084 cid_4521392
Type:
Small organic molecule
Emp. Form.:
C22H16N4O3
Mol. Mass.:
384.3874
SMILES:
NC(=O)c1ccc(cc1)-c1nc(c([nH]1)-c1ccc2OCOc2c1)-c1ccccn1
: