Target
Myosin light chain kinase 2, skeletal/cardiac muscle
Ligand
BDBM5931
Substrate
Meas. Tech.
ChEMBL_586581 (CHEMBL1061160)
Kd
980±n/a nM
Citation
 Karaman, MWHerrgard, STreiber, DKGallant, PAtteridge, CECampbell, BTChan, KWCiceri, PDavis, MIEdeen, PTFaraoni, RFloyd, MHunt, JPLockhart, DJMilanov, ZVMorrison, MJPallares, GPatel, HKPritchard, SWodicka, LMZarrinkar, PP A quantitative analysis of kinase inhibitor selectivity. Nat Biotechnol 26:127-32 (2008)  
Target
Name:
Myosin light chain kinase 2, skeletal/cardiac muscle
Synonyms:
MYLK2 myosin light chain kinase 2
Type:
PROTEIN
Mol. Mass.:
64687.13
Organism:
Homo sapiens (Human)
Description:
ChEMBL_586581
Residue:
596
  
Inhibitor
Name:
BDBM5931
Synonyms:
BMS-387072 N-(5-{[(5-tert-butyl-1,3-oxazol-2-yl)methyl]sulfanyl}-1,3-thiazol-2-yl)piperidine-4-carboxamide cid_3025986
Type:
Small organic molecule
Emp. Form.:
C17H24N4O2S2
Mol. Mass.:
380.528
SMILES:
CC(C)(C)c1cnc(CSc2cnc(NC(=O)C3CCNCC3)s2)o1
: