Target
SRSF protein kinase 2
Ligand
BDBM7533
Substrate
Meas. Tech.
ChEMBL_586362 (CHEMBL1061928)
Kd
>10000±n/a nM
Citation
 Karaman, MWHerrgard, STreiber, DKGallant, PAtteridge, CECampbell, BTChan, KWCiceri, PDavis, MIEdeen, PTFaraoni, RFloyd, MHunt, JPLockhart, DJMilanov, ZVMorrison, MJPallares, GPatel, HKPritchard, SWodicka, LMZarrinkar, PP A quantitative analysis of kinase inhibitor selectivity. Nat Biotechnol 26:127-32 (2008)  
Target
Name:
SRSF protein kinase 2
Synonyms:
SFRS protein kinase 2 SRPK2 SRSF protein kinase 2 SRSF protein kinase 2 N-terminal Serine/threonine-protein kinase SRPK2
Type:
PROTEIN
Mol. Mass.:
77488.98
Organism:
Homo sapiens (Human)
Description:
ChEMBL_774248
Residue:
688
  
Inhibitor
Name:
BDBM7533
Synonyms:
(2R)-2-[[6-(benzylamino)-9-isopropyl-purin-2-yl]amino]butan-1-ol (2R)-2-[[6-[(phenylmethyl)amino]-9-propan-2-yl-2-purinyl]amino]-1-butanol (2R)-2-{[6-(benzylamino)-9-(propan-2-yl)-9H-purin-2-yl]amino}butan-1-ol 2,6,9-Trisubstituted purine deriv. 28 CYC-202 cid_160355
Type:
Small organic molecule
Emp. Form.:
C19H26N6O
Mol. Mass.:
354.4493
SMILES:
CC[C@H](CO)Nc1nc(NCc2ccccc2)c2ncn(C(C)C)c2n1
: