Target
Testis-specific serine/threonine-protein kinase 1
Ligand
BDBM21079
Substrate
Meas. Tech.
ChEMBL_587106 (CHEMBL1051316)
Kd
>10000±n/a nM
Citation
 Karaman, MWHerrgard, STreiber, DKGallant, PAtteridge, CECampbell, BTChan, KWCiceri, PDavis, MIEdeen, PTFaraoni, RFloyd, MHunt, JPLockhart, DJMilanov, ZVMorrison, MJPallares, GPatel, HKPritchard, SWodicka, LMZarrinkar, PP A quantitative analysis of kinase inhibitor selectivity. Nat Biotechnol 26:127-32 (2008)  
Target
Name:
Testis-specific serine/threonine-protein kinase 1
Synonyms:
SPOGA1 STK22A TSSK1 TSSK1_HUMAN | Testis-specific serine/threonine-protein kinase 1
Type:
Enzyme Catalytic Domain
Mol. Mass.:
41624.03
Organism:
Homo sapiens (Human)
Description:
gi_14042947
Residue:
367
  
Inhibitor
Name:
BDBM21079
Synonyms:
1-[4-(3-amino-1H-indazol-4-yl)phenyl]-3-(2-fluoro-5-methyl-phenyl)urea 1-[4-(3-azanyl-1H-indazol-4-yl)phenyl]-3-(2-fluoranyl-5-methyl-phenyl)urea ABT-869 CHEMBL223360 | cid_11485656
Type:
Small organic molecule
Emp. Form.:
C21H18FN5O
Mol. Mass.:
375.3989
SMILES:
Cc1ccc(F)c(NC(=O)Nc2ccc(cc2)-c2cccc3[nH]nc(N)c23)c1
: