Target
Testis-specific serine/threonine-protein kinase 1
Ligand
BDBM6866
Substrate
Meas. Tech.
ChEMBL_587106 (CHEMBL1051316)
Kd
>10000±n/a nM
Citation
 Karaman, MWHerrgard, STreiber, DKGallant, PAtteridge, CECampbell, BTChan, KWCiceri, PDavis, MIEdeen, PTFaraoni, RFloyd, MHunt, JPLockhart, DJMilanov, ZVMorrison, MJPallares, GPatel, HKPritchard, SWodicka, LMZarrinkar, PP A quantitative analysis of kinase inhibitor selectivity. Nat Biotechnol 26:127-32 (2008)  
Target
Name:
Testis-specific serine/threonine-protein kinase 1
Synonyms:
SPOGA1 STK22A TSSK1 TSSK1_HUMAN | Testis-specific serine/threonine-protein kinase 1
Type:
Enzyme Catalytic Domain
Mol. Mass.:
41624.03
Organism:
Homo sapiens (Human)
Description:
gi_14042947
Residue:
367
  
Inhibitor
Name:
BDBM6866
Synonyms:
1-Acyl-1H-[1,2,4]triazole-3,5-diamine Analogue 3b 4-[[5-Amino-1-(2,6-difluorobenzoyl)-1H-1,2,4-triazol-3-yl]amino]-benzenesulfonamide JNJ-7706621 | cid_5330790
Type:
Small organic molecule
Emp. Form.:
C15H12F2N6O3S
Mol. Mass.:
394.356
SMILES:
Nc1nc(Nc2ccc(cc2)S(N)(=O)=O)nn1C(=O)c1c(F)cccc1F
: