Target
Acetylcholinesterase
Ligand
BDBM50298399
Substrate
Meas. Tech.
ChEMBL_588496 (CHEMBL1041236)
IC50
14700±n/a nM
Citation
 Ronco, CSorin, GNachon, FFoucault, RJean, LRomieu, ARenard, PY Synthesis and structure-activity relationship of Huprine derivatives as human acetylcholinesterase inhibitors. Bioorg Med Chem 17:4523-36 (2009)  
Target
Name:
Acetylcholinesterase
Synonyms:
ACES_HUMAN Acetylcholinesterase (AChE) | Acetylcholinesterase (human AChE)
Type:
Enzyme
Mol. Mass.:
67792.70
Organism:
Homo sapiens (Human)
Description:
P22303
Residue:
614
  
Inhibitor
Name:
BDBM50298399
Synonyms:
(+/-)-3-Chloro-12-hydroxy-6,7,10,11-tetrahydro-9-methyl-7,11-ethanocyclooctan[b]quinoline | CHEMBL575166
Type:
Small organic molecule
Emp. Form.:
C17H16ClNO
Mol. Mass.:
285.768
SMILES:
CC1=CC2CC(C1)c1c(C2)nc2cc(Cl)ccc2c1O
: