Target
Acetylcholinesterase
Ligand
BDBM50298407
Substrate
Meas. Tech.
ChEMBL_588496 (CHEMBL1041236)
IC50
810±n/a nM
Citation
 Ronco, CSorin, GNachon, FFoucault, RJean, LRomieu, ARenard, PY Synthesis and structure-activity relationship of Huprine derivatives as human acetylcholinesterase inhibitors. Bioorg Med Chem 17:4523-36 (2009)  
Target
Name:
Acetylcholinesterase
Synonyms:
ACES_HUMAN Acetylcholinesterase (AChE) | Acetylcholinesterase (human AChE)
Type:
Enzyme
Mol. Mass.:
67792.70
Organism:
Homo sapiens (Human)
Description:
P22303
Residue:
614
  
Inhibitor
Name:
BDBM50298407
Synonyms:
(+/-)-11-Amino-8-methyl-5,6,9,10-tetrahydro-6,10-methanocyclooctabenzo[b][1,8]naphthyridine | CHEMBL575613
Type:
Small organic molecule
Emp. Form.:
C16H17N3
Mol. Mass.:
251.3263
SMILES:
CC1=CC2CC(C1)c1c(C2)nc2ncccc2c1N
: